{"text_format":"1","workbook":"xlsx","n_sheets":11,"sheets":["使用方法","１ページ","２ページ","３ページ","４ページ","５ページ","６ページ","７ページ","欠格要件申告","提出書類リスト","補足説明"],"not_rendered":{"charts":0,"images":3,"macros":1,"external_links":0,"defined_names":7,"comments":8,"pivot_tables":0},"unopened":[],"bounds":{"document_bytes":16777216,"sheet_cells":100000,"rows_first":2000,"rows_last":500,"rows_between":2000,"halvings":0,"cell_chars":16384,"cell_head_chars":4096},"cells_cut":0,"cells_raw":0,"read":"whole","date_system":"1900"}

{"sheet":"使用方法","index":0,"n_rows":47,"n_cols":2,"rows_kept":47,"cut":false,"hidden":false,"merged":[[0,0,0,9]]}
["エコアップ認証更新申請書　（Excel版）"]
[]
[]
["本ファイルの利用方法"]
["１．概要"]
[null,"・本シートは「エコアップ認証更新申請書」におけるExcel版様式です。"]
[null,"・Ｐ３ページのCO2排出量実績は、実績数値等を記入すれば、原単位数や集計結果が自動計算されます。"]
[null," また、《マクロ》ボタンを利用すれば 「CO2排出量換算シート」ファイルから、排出量実績をはじめ、表の"]
[null,"  必要データが一発で自動転記されるので、手間なく表を完成させることができます。"]
[]
["２．全般的な記入方法"]
[null,"・本ファイルではページシートの増減はできません。記入内容は各シート内に収まるように記載してください。"]
[null,"・本シートでは　　黄色と　　　水色のセルに記入できます。水色セルにはプルダウンリストがあります。"]
[null,"・薄茶色の箇所は結合セルになっており、文を途中で改行したい場合は”Alt+Enter（Return)”で行えます。"]
[null,"・「３ページ」、「４ページ」、「５ページ」の表部分の数値は直接記入する方法と、マクロボタンにより"]
[null," 「CO2排出量換算シート」から、自動転記する方法とどちらでも作成できます。"]
[null,"・「３ページ」の表の水色セルのプルダウンリストに該当する項目が無い場合、欄外 の”●原単位活動指標表”"]
[null,"の黄色の欄に所望の項目等を新たに追記すると、リストに対象が追加されます。"]
[null,"・「３ページ」の「・・・の入力データの消去」ボタンをクックすると、表の黄色に記入 したデータを一括して消去"]
[null,"することができます。"]
[]
["３．提出するシート"]
[null,"・提出が必要なシートは１ページ～７ページと、「欠格要件申告」シートまでです。 "]
[null,"  それ以外のページは原則提出不要です。"]
[null,"・提出に際しては、本書式のほかに「添付書類リスト」にある※印のついた必要書類も提出します。"]
[null,"・ 「補足説明」シートは適宜、必要な場合のみ追加します。"]
[null,"　所定シートに書ききれない場合は、そのシートで行の挿入は行わず（様式では作業ができないように"]
[null,"　なっている）、文字サイズを縮小するか、 「補足説明」シートを利用します。"]
[]
["４．マクロの使用方法"]
{"$rows_left_out":18}
{"sheet":"１ページ","index":1,"n_rows":47,"n_cols":39,"rows_kept":47,"cut":false,"hidden":false,"merged":[[13,1,13,15],[40,6,41,15],[40,4,41,5],[42,4,43,5],[42,6,43,15],[16,4,16,15],[17,4,19,15],[40,1,41,3],[20,4,24,15],[42,1,43,3],[29,1,30,3],[29,4,30,5],[29,10,30,11],[29,12,30,15],[29,6,30,9],[44,1,46,3],[37,4,39,5],[34,6,36,9],[34,12,36,15],[37,12,39,15],[37,6,39,9],[2,1,2,15],[31,4,33,5],[34,4,36,5],[31,10,33,11],[31,12,33,15],[16,1,16,3],[25,4,28,15],[34,10,36,11],[31,1,39,3],[20,1,24,3],[17,1,19,3],[25,1,28,3],[31,6,33,9],[4,9,4,10],[7,9,9,15],[10,9,11,15]]}
["様式第１－２号（第３条第２項関係）"]
[]
[null,"埼玉県エコアップ認証事業所　　更新認証申請書"]
[]
[null,null,null,null,null,null,null,null,null,"令和４",null,"年",null,"月",null,"日"]
[null,"（あて先）",null,null,null,null,null,null,null,null,null,null,null,null,null,null,null,null,null,null,null,null,null,null,null,null,null,null,null,null,null,null,null,null,null,null,null,null,"令和１"]
[null,"埼玉県知事　",null,null,null,null,null,null,null,null,null,null,null,null,null,null,null,null,null,null,null,null,null,null,null,null,null,null,null,null,null,null,null,null,null,null,null,null,"令和２"]
[null,null,null,null,null,"報告者","氏名又は名称",null,null,null,null,null,null,null,null,null,null,null,null,null,null,null,null,null,null,null,null,null,null,null,null,null,null,null,null,null,null,null,"令和３"]
[null,null,null,null,null,null,"住所",null,null,null,null,null,null,null,null,null,null,null,null,null,null,null,null,null,null,null,null,null,null,null,null,null,null,null,null,null,null,null,"令和４"]
[null,null,null,null,null,null,null,null,"法人の場合は代表者氏名",null,null,null,null,null,null,null,null,null,null,null,null,null,null,null,null,null,null,null,null,null,null,null,null,null,null,null,null,null,"令和５"]
[null,null,null,null,null,null,"電話番号",null,null,null,null,null,null,null,null,null,null,null,null,null,null,null,null,null,null,null,null,null,null,null,null,null,null,null,null,null,null,null,"令和６"]
[null,null,null,null,null,null,null,null,null,null,null,null,null,null,null,null,null,null,null,null,null,null,null,null,null,null,null,null,null,null,null,null,null,null,null,null,null,null,"令和７"]
[null,null,null,null,null,null,null,null,null,null,null,null,null,null,null,null,null,null,null,null,null,null,null,null,null,null,null,null,null,null,null,null,null,null,null,null,null,null,"令和９"]
[null,"埼玉県エコアップ認証制度実施要綱第３条第２項の規定により、埼玉県エコアップ認証事業所の認証について、次のとおり申請します。",null,null,null,null,null,null,null,null,null,null,null,null,null,null,null,null,null,null,null,null,null,null,null,null,null,null,null,null,null,null,null,null,null,null,null,null,"令和１０"]
[null,null,null,null,null,null,null,null,null,null,null,null,null,null,null,null,null,null,null,null,null,null,null,null,null,null,null,null,null,null,null,null,null,null,null,null,null,null,"令和１１"]
[null,"事業活動の概要",null,null,null,null,null,null,null,null,null,null,null,null,null,null,null,null,null,null,null,null,null,null,null,null,null,null,null,null,null,null,null,null,null,null,null,null,"令和１２"]
[null,"ふりがな",null,null,null,null,null,null,null,null,null,null,null,null,null,null,null,null,null,null,null,null,null,null,null,null,null,null,null,null,null,null,null,null,null,null,null,null,"令和１３"]
[null,"事業所の名称\n(認証範囲も記載）",null,null,null,null,null,null,null,null,null,null,null,null,null,null,null,null,null,null,null,null,null,null,null,null,null,null,null,null,null,null,null,null,null,null,null,null,"令和１４"]
[null,null,null,null,null,null,null,null,null,null,null,null,null,null,null,null,null,null,null,null,null,null,null,null,null,null,null,null,null,null,null,null,null,null,null,null,null,null,"令和１５"]
[null,null,null,null,null,null,null,null,null,null,null,null,null,null,null,null,null,null,null,null,null,null,null,null,null,null,null,null,null,null,null,null,null,null,null,null,null,null,"令和１６"]
[null,"事業所の所在地",null,null,null,null,null,null,null,null,null,null,null,null,null,null,null,null,null,null,null,null,null,null,null,null,null,null,null,null,null,null,null,null,null,null,null,null,"令和１７"]
[null,null,null,null,null,null,null,null,null,null,null,null,null,null,null,null,null,null,null,null,null,null,null,null,null,null,null,null,null,null,null,null,null,null,null,null,null,null,"令和１８"]
[null,null,null,null,null,null,null,null,null,null,null,null,null,null,null,null,null,null,null,null,null,null,null,null,null,null,null,null,null,null,null,null,null,null,null,null,null,null,"令和１９"]
[null,null,null,null,null,null,null,null,null,null,null,null,null,null,null,null,null,null,null,null,null,null,null,null,null,null,null,null,null,null,null,null,null,null,null,null,null,null,"令和２０"]
[null,null,null,null,null,null,null,null,null,null,null,null,null,null,null,null,null,null,null,null,null,null,null,null,null,null,null,null,null,null,null,null,null,null,null,null,null,null,"令和２１"]
[null,"事業の内容",null,null,null,null,null,null,null,null,null,null,null,null,null,null,null,null,null,null,null,null,null,null,null,null,null,null,null,null,null,null,null,null,null,null,null,null,"令和２２"]
[]
[]
[]
[null,"日本標準産業\n分類（細分類）",null,null,"名　称",null,null,null,null,null,"番　号"]
{"$rows_left_out":18}
{"sheet":"２ページ","index":2,"n_rows":15,"n_cols":26,"rows_kept":15,"cut":false,"hidden":false,"merged":[[2,2,2,5],[2,6,2,8],[7,2,7,5],[8,2,8,5],[8,6,8,8],[2,14,2,17],[2,18,2,20],[8,10,8,12],[8,14,8,16],[8,18,8,20],[7,10,7,13],[7,14,7,17],[7,18,7,21],[15,2,46,25],[11,10,11,12],[11,14,11,16],[11,18,11,20],[11,22,11,25],[12,2,12,5],[12,6,12,8],[12,10,12,12],[12,14,12,16],[12,18,12,20],[11,6,11,8],[11,2,11,5],[12,22,12,25],[7,22,7,25],[9,2,9,5],[9,6,9,8],[8,22,8,24],[10,22,10,25],[9,10,9,12],[9,14,9,16],[9,18,9,20],[9,22,9,24],[10,10,10,13],[10,14,10,17],[10,18,10,21],[10,2,10,5],[7,6,7,9],[10,6,10,9]]}
[null,"１　環境方針",null,null,null,null,"※（対外的に公表しているものがあれば、その写しを添付すること。）"]
[]
[null,null,"制定日",null,null,null,null,null,null,"年",null,"月",null,"日","改訂日",null,null,null,null,null,null,"年",null,"月",null,"日"]
[null,null,null,null,null,null,null,null,null,null,null,null,null,null,"＊改訂されていれば改正日も記入"]
[null,"２　環境負荷の現状"]
[null,null,"（１）環境保全の取組のチェック結果　※前回認証時からの達成率の変化状況"]
[]
[null,null,"項　　目",null,null,null,"廃棄物",null,null,null,"大気・水質",null,null,null,"化学物質",null,null,null,"節水・水",null,null,null,"製品開発"]
[null,null,"今回達成率",null,null,null,null,null,null,"％",null,null,null,"％",null,null,null,"％",null,null,null,"％",null,null,null,"％"]
[null,null,"前回認証時達成率",null,null,null,null,null,null,"％",null,null,null,"％",null,null,null,"％",null,null,null,"％",null,null,null,"％"]
[null,null,"項　　目",null,null,null,"建築・開発",null,null,null,"グリーン購入",null,null,null,"環境教育",null,null,null,"その他"]
[null,null,"今回達成率",null,null,null,null,null,null,"％",null,null,null,"％",null,null,null,"％",null,null,null,"％"]
[null,null,"前回認証時達成率",null,null,null,null,null,null,"％",null,null,null,"％",null,null,null,"％",null,null,null,"％"]
[]
[null,null,"（取組に関する情報・説明）　※各項目の取り組んだ事項を記載する。"]

{"sheet":"３ページ","index":3,"n_rows":61,"n_cols":30,"rows_kept":61,"cut":false,"hidden":false,"merged":[[57,3,57,4],[58,3,58,4],[59,3,59,4],[60,1,60,2],[60,3,60,4],[55,3,56,4],[55,5,56,5],[55,6,56,6],[55,7,56,7],[55,11,56,11],[48,3,48,4],[49,3,49,4],[50,3,50,4],[51,1,51,2],[51,3,51,4],[45,3,46,4],[45,5,46,5],[45,6,46,6],[45,9,46,9],[47,1,47,2],[47,3,47,4],[40,1,40,2],[40,3,40,4],[36,1,36,2],[36,3,36,4],[37,3,37,4],[38,3,38,4],[39,3,39,4],[34,9,35,9],[14,3,14,4],[19,1,20,2],[19,3,20,4],[21,3,21,4],[26,1,27,2],[26,3,27,4],[28,3,28,4],[33,3,33,4],[34,3,35,4],[34,5,35,5],[34,6,35,6],[5,1,6,2],[5,3,6,4],[7,3,7,4],[12,1,13,2],[12,3,13,4]]}
["（２）環境への負荷のチェック結果"]
[]
[]
[]
[null,"ア）建物系ＣＯ₂排出量実績",null,null,null,null,null,null,null,null,null,null,null,null,null,null,null,"年度",20,21,22,23,24,25,26,27,28,29,30,31]
[null,"項　　　目",null,"単位指標等",null,null,{"$f":"IF(F6=\"\",\"\",IF(F6=\"31/1\",2,IF(F6=30,1,F6+1)))","v":""},{"$f":"IF(G6=\"\",\"\",IF(G6=\"31/1\",2,IF(G6=30,1,G6+1)))","v":""},{"$f":"IF(H6=\"\",\"\",IF(H6=\"31/1\",2,IF(H6=30,1,H6+1)))","v":""},null,null,null,null,null,null,null,null,"建物系",{"$f":"IF($P$3=1,S12+S18,S12)","v":0},{"$f":"IF($P$3=1,T12+T18,T12)","v":0},0,0,0,0,0,0,0,0,0,0]
[null,null,null,null,null,"年度","年度","年度","年度",null,null,null,null,null,null,null,null,"工場・現場系",{"$f":"IF($P$3=1,S13+S19,S13)","v":0},0,0,0,0,0,0,0,0,0,0,0]
[null,"ＣＯ₂排出量",null,"ｔ-ＣＯ₂／年",null,null,null,null,null,null,null,null,null,null,null,null,null,"自動車系",{"$f":"IF($P$3=1,S14+S20,S14)","v":0},0,0,0,0,0,0,0,0,0,0,0]
[null,{"$f":"D10&\"当たり\"","v":"当たり"},null,"ｔ-ＣＯ₂／",{"$f":"IFERROR(E10,\"\")","v":""},{"$f":"IFERROR(ROUND(F8/F10,4),\"\")","v":""},{"$f":"IFERROR(ROUND(G8/G10,4),\"\")","v":""},"","",null,null,null,{"$f":"MATCH(D10,$N$12:$N$21,0)","v":{"$error":"#N/A"}}]
[null,"原単位の指標",null,null,{"$f":"IFERROR(INDEX($O$12:$O$21,M9),\"\")","v":""},null,null,null,null,null,null,null,null,"●原単位活動指標表",null,null,null,"ＣＯ₂排出量補正結果"]
[null,null,null,null,null,null,null,null,null,null,null,null,null,"指標名","単位",null,"当たり","年度",20,21,22,23,24,25,26,27,28,29,30,31]
[null,"イ）工場・現場系ＣＯ₂排出量実績",null,null,null,null,null,null,null,null,null,null,null,"（床面積）","㎡",null,null,"建物系",0,0,0,0,0,0,0,0,0,0,0,0]
[null,"項　　　目",null,"単位指標等",null,{"$f":"IF(F6=\"\",\"\",F6)","v":""},{"$f":"IF(G6=\"\",\"\",G6)","v":""},{"$f":"IF(H6=\"\",\"\",H6)","v":""},{"$f":"IF(I6=\"\",\"\",I6)","v":""},null,null,null,null,"（敷地面積）","㎡",null,null,"工場・現場系",0,0,0,0,0,0,0,0,0,0,0,0]
[null,null,null,null,null,"年度","年度","年度","年度",null,null,null,null,"（売上額）","億円",null,null,"自動車系",0,0,0,0,0,0,0,0,0,0,0,0]
[null,"ＣＯ₂排出量",null,"ｔ-ＣＯ₂／年",null,null,null,null,null,null,null,null,null,"（受注額）","億円"]
[null,{"$f":"D17&\"当たり\"","v":"当たり"},null,"ｔ-ＣＯ₂／",{"$f":"IFERROR(E17,\"\")","v":""},{"$f":"IFERROR(ROUND(F15/F17,4),\"\")","v":""},{"$f":"IFERROR(ROUND(G15/G17,4),\"\")","v":""},"","",null,null,null,{"$f":"MATCH(D17,$N$12:$N$21,0)","v":{"$error":"#N/A"}},"（従業員数）","人",null,null,"その他のＣＯ₂排出量"]
[null,"原単位の指標",null,null,{"$f":"IFERROR(INDEX($O$12:$O$21,M16),\"\")","v":""},null,null,null,null,null,null,null,null,"（台数）","台",null,null,"年度",20,21,22,23,24,25,26,27,28,29,30,31]
[null,null,null,null,null,null,null,null,null,null,null,null,null,"（走行距離）","千km",null,null,"建物系",0,0,0,0,0,0,0,0,0,0,0,0]
[null,"ウ）自動車系ＣＯ₂排出量実績",null,null,null,null,null,null,null,null,null,null,null,"（生産量）","ﾄﾝ",null,null,"工場・現場系",0,0,0,0,0,0,0,0,0,0,0,0]
[null,"項　　　目",null,"単位指標等",null,{"$f":"IF(F6=\"\",\"\",F6)","v":""},{"$f":"IF(G6=\"\",\"\",G6)","v":""},"","",null,null,null,null,null,null,null,null,"自動車系",0,0,0,0,0,0,0,0,0,0,0,0]
[null,null,null,null,null,"年度","年度","年度","年度"]
[null,"ＣＯ₂排出量",null,"ｔ-ＣＯ₂／年"]
[null,{"$f":"D24&\"当たり\"","v":"当たり"},null,"ｔ-ＣＯ₂／",{"$f":"IFERROR(E24,\"\")","v":""},{"$f":"IFERROR(ROUND(F22/F24,4),\"\")","v":""},{"$f":"IFERROR(ROUND(G22/G24,4),\"\")","v":""},"","",null,null,null,{"$f":"MATCH(D24,$N$12:$N$21,0)","v":{"$error":"#N/A"}}]
[null,"原単位の指標",null,null,{"$f":"IFERROR(INDEX($O$12:$O$21,M23),\"\")","v":""}]
[]
[null,"エ）（ア＋イ＋ウ）合計"]
[null,"項　　　目",null,"単位指標等",null,{"$f":"IF(F6=\"\",\"\",F6)","v":""},{"$f":"IF(G6=\"\",\"\",G6)","v":""},"","",null,null,null,null,null,null,null,"）"]
[null,null,null,null,null,"年度","年度","年度","年度"]
[null,"ＣＯ₂排出量",null,"ｔ-ＣＯ₂／年",null,{"$f":"IFERROR(F8+F15+F22,\"\")","v":0},{"$f":"IFERROR(G8+G15+G22,\"\")","v":0},0,0]
[null,{"$f":"D31&\"当たり\"","v":"当たり"},null,"ｔ-ＣＯ₂／",{"$f":"IFERROR(E31,\"\")","v":""},{"$f":"IFERROR(ROUND(F29/F31,4),\"\")","v":""},{"$f":"IFERROR(ROUND(G29/G31,4),\"\")","v":""},"","",null,null,null,{"$f":"MATCH(D31,$N$12:$N$21,0)","v":{"$error":"#N/A"}}]
{"$rows_left_out":32}
{"sheet":"４ページ","index":4,"n_rows":64,"n_cols":31,"rows_kept":64,"cut":false,"hidden":false,"merged":[[23,1,43,11],[47,1,60,11],[64,1,72,11],[4,3,5,4],[4,5,5,5],[4,6,5,6],[14,11,15,11],[6,3,6,4],[8,3,8,4],[9,3,9,4],[14,5,15,5],[14,3,15,4],[19,1,19,2],[4,9,5,9],[6,1,6,2],[14,6,15,6],[7,3,7,4],[14,7,15,7],[10,1,10,2],[19,3,19,4],[10,3,10,4],[18,3,18,4],[17,3,17,4],[16,3,16,4]]}
["（３）二酸化炭素排出量及び原単位の過去３年間の目標と実績の比較　"]
[]
[null,"ア） ３年前の申請時の目標"]
[null,"年　　度",null,"ＣＯ₂排出量",null,"削減量","削減率","ＣＯ₂原単位","削減量","削減率"]
[null,null,null,"（ｔ-ＣＯ₂）",null,"（ｔ-ＣＯ₂）","（％）","当たり","当たり","（％）",null,null,null,null,null,null,null,null,"年度",20,21,22,23,24,25,26,27,28,29,30,31]
[null,null,null,null,null,null,null,"ｔ-ＣＯ₂／）","ｔ-ＣＯ₂／）",null,null,null,null,null,null,null,null,null,"建物系",{"$f":"IF($Q$3=1,T12+T18,T12)","v":0},{"$f":"IF($Q$3=1,U12+U18,U12)","v":0},0,0,0,0,0,0,0,0,0,0]
[null,"基準値",null,null,null,null,null,null,null,null,null,null,null,null,null,null,null,null,"工場・現場系",{"$f":"IF($Q$3=1,T13+T19,T13)","v":0},0,0,0,0,0,0,0,0,0,0,0]
[null,null,"年度",null,null,null,{"$f":"IF(F8=\"\",\"\",F8/D$7*100)","v":""},null,null,{"$f":"IF(I8=\"\",\"\",I8/H$7*100)","v":""},null,null,null,null,null,null,null,null,"自動車系",{"$f":"IF($Q$3=1,T14+T20,T14)","v":0},0,0,0,0,0,0,0,0,0,0,0]
[null,null,"年度",null,null,null,{"$f":"IF(F9=\"\",\"\",F9/D$7*100)","v":""},null,null,{"$f":"IF(I9=\"\",\"\",I9/H$7*100)","v":""}]
[null,null,"年度",null,null,null,{"$f":"IF(F10=\"\",\"\",F10/D$7*100)","v":""},null,null,{"$f":"IF(I10=\"\",\"\",I10/H$7*100)","v":""},null,null,null,null,"●原単位活動指標表",null,null,null,"ＣＯ₂排出量補正結果"]
[null,"平均削減率",null,null,null,null,{"$f":"IF(G8=\"\",\"\",AVERAGE(G8:G10))","v":""},null,null,{"$f":"IF(J8=\"\",\"\",AVERAGE(J8:J10))","v":""},null,null,null,null,"指標名","単位",null,"当たり","年度",20,21,22,23,24,25,26,27,28,29,30,31]
[null,null,null,null,null,null,null,null,null,null,null,null,null,null,"（床面積）","㎡",null,null,"建物系",0,0,0,0,0,0,0,0,0,0,0,0]
[null,"イ） 過去３年間の実績（認証以降の排出量・原単位実績）",null,null,null,null,null,null,null,null,null,null,null,null,"（敷地面積）","㎡",null,null,"工場・現場系",0,0,0,0,0,0,0,0,0,0,0,0]
[null,"年　　度",null,"ＣＯ₂排出量",null,"基準値","削減量","削減率","ＣＯ₂原単位","基準値","削減量","削減率",null,null,"（売上額）","億円",null,null,"自動車系",0,0,0,0,0,0,0,0,0,0,0,0]
[null,null,null,"（ｔ-ＣＯ₂）",null,"（ｔ-ＣＯ₂）","（ｔ-ＣＯ₂）","（％）",{"$f":"'３ページ'!$D$30&\"当たり\"","v":"ｔ-ＣＯ₂／当たり"},{"$f":"I15","v":"ｔ-ＣＯ₂／当たり"},{"$f":"J15","v":"ｔ-ＣＯ₂／当たり"},"（％）",null,null,"（受注額）","億円"]
[null,null,null,null,null,null,null,null,{"$f":"'３ページ'!$H$36","v":"ｔ-ＣＯ₂／）"},{"$f":"I16","v":"ｔ-ＣＯ₂／）"},{"$f":"J16","v":"ｔ-ＣＯ₂／）"},null,null,null,"（従業員数）","人",null,null,"その他のＣＯ₂排出量"]
[null,null,"年度",{"$f":"IF(B17=\"\",\"\",IFERROR((HLOOKUP(B17,実績合計,3,FALSE)),\"\"))","v":""},null,null,{"$f":"IF(D17=\"\",\"\",D17-D$7)","v":""},{"$f":"IF(G17=\"\",\"\",G17/D$7*100)","v":""},{"$f":"IFERROR((HLOOKUP(A17,#REF!,4,FALSE)),\"\")","v":""},{"$f":"IFERROR((HLOOKUP(B17,#REF!,4,FALSE)),\"\")","v":""},{"$f":"IF(J17=\"\",\"\",J17-H$7)","v":""},{"$f":"IF(K17=\"\",\"\",K17/I$7*100)","v":""},null,null,"（台数）","台",null,null,"年度",20,21,22,23,24,25,26,27,28,29,30,31]
[null,{"$f":"IF(B17=\"\",\"\",IF(B17=\"31/1\",2,IF(B17=30,1,B17+1)))","v":""},"年度",{"$f":"IF(B18=\"\",\"\",IFERROR((HLOOKUP(B18,実績合計,3,FALSE)),\"\"))","v":""},null,null,{"$f":"IF(D18=\"\",\"\",D18-D$7)","v":""},{"$f":"IF(G18=\"\",\"\",G18/D$7*100)","v":""},{"$f":"IFERROR((HLOOKUP(A18,#REF!,4,FALSE)),\"\")","v":""},{"$f":"IFERROR((HLOOKUP(B18,#REF!,4,FALSE)),\"\")","v":""},{"$f":"IF(J18=\"\",\"\",J18-H$7)","v":""},{"$f":"IF(K18=\"\",\"\",K18/I$7*100)","v":""},null,null,"（走行距離）","千km",null,null,"建物系",0,0,0,0,0,0,0,0,0,0,0,0]
[null,{"$f":"IF(B18=\"\",\"\",IF(B18=\"31/1\",2,IF(B18=30,1,B18+1)))","v":""},"年度",{"$f":"IF(B19=\"\",\"\",IFERROR((HLOOKUP(B19,実績合計,3,FALSE)),\"\"))","v":""},null,null,{"$f":"IF(D19=\"\",\"\",D19-D$7)","v":""},{"$f":"IF(G19=\"\",\"\",G19/D$7*100)","v":""},{"$f":"IFERROR((HLOOKUP(A19,#REF!,4,FALSE)),\"\")","v":""},{"$f":"IFERROR((HLOOKUP(B19,#REF!,4,FALSE)),\"\")","v":""},{"$f":"IF(J19=\"\",\"\",J19-H$7)","v":""},{"$f":"IF(K19=\"\",\"\",K19/I$7*100)","v":""},null,null,"（生産量）","ﾄﾝ",null,null,"工場・現場系",0,0,0,0,0,0,0,0,0,0,0,0]
[null,"平均削減率",null,null,null,null,null,{"$f":"IF(H17=\"\",\"\",AVERAGE(H17:H19))","v":""},null,null,null,{"$f":"IF(L17=\"\",\"\",AVERAGE(L17:L19))","v":""},null,null,null,null,null,null,"自動車系",0,0,0,0,0,0,0,0,0,0,0,0]
[]
["（４）二酸化炭素排出量等の増減に関する情報・説明 "]
[null,"（３年前の排出量目標に対する増減、達成状況に関すること）"]
[null,null,null,null,null,null,null,null,null,null,null,null,null,{"$f":"MATCH(#REF!,$O$12:$O$21,0)","v":{"$error":"#REF!"}}]
[]
[]
[null,null,null,null,null,null,null,null,null,null,null,null,null,null,null,null,null,"）"]
[]
[]
[]
{"$rows_left_out":35}
{"sheet":"５ページ","index":5,"n_rows":29,"n_cols":11,"rows_kept":29,"cut":false,"hidden":false,"merged":[[3,4,3,5],[3,2,3,3],[4,10,5,10],[6,2,6,3],[10,2,10,3],[4,8,5,8],[4,9,5,9],[4,7,5,7],[4,4,4,5],[14,2,25,10],[29,2,39,10],[7,4,7,5],[6,4,6,5],[8,4,8,5],[9,4,9,5],[10,4,10,5]]}
[null,null,"４　環境への負荷低減の目標"]
[]
[null,null,"（１）二酸化炭素の削減目標　（基準値：直近の３か年平均",null,null,null,null,null,null,null,"　　　　　ｔ－ＣＯ２）"]
[null,null,"年　　度",null,"ＣＯ₂排出量",null,"削減量","削減率","ＣＯ₂原単位","削減量","削減率"]
[null,null,null,null,"（ｔ-ＣＯ₂）",null,"（ｔ-ＣＯ₂）","（％）",null,null,"（％）"]
[]
[null,null,"基準値"]
[null,null,null,"年度",null,null,{"$f":"IF(E8=\"\",\"\",E8-E$7)","v":""},{"$f":"IF(G8=\"\",\"\",G8/E$7*100)","v":""},null,{"$f":"IF(I8=\"\",\"\",I8-I$7)","v":""},{"$f":"IF(J8=\"\",\"\",J8/I$7*100)","v":""}]
[null,null,null,"年度",null,null,{"$f":"IF(E9=\"\",\"\",E9-E$7)","v":""},{"$f":"IF(G9=\"\",\"\",G9/E$7*100)","v":""},null,{"$f":"IF(I9=\"\",\"\",I9-I$7)","v":""},{"$f":"IF(J9=\"\",\"\",J9/I$7*100)","v":""}]
[null,null,null,"年度",null,null,"","",null,"",""]
[null,null,"平均削減率",null,null,null,null,{"$f":"IF(H8=\"\",\"\",AVERAGE(H8:H10))","v":""},null,null,{"$f":"IF(K8=\"\",\"\",AVERAGE(K8:K10))","v":""}]
[]
[null,null,"（２）二酸化炭素排出量等の削減目標に関する情報・説明"]
[null,null,"（電気使用量、ガス使用量、自動車燃料等に関すること）"]
[]
[]
[]
[]
[]
[]
[]
[]
[]
[]
[]
[]
[]
[null,null,"（３）その他環境に重大な影響を与える項目の目標及びその情報・説明"]
[null,null,"（廃棄物等に関すること）"]

{"sheet":"６ページ","index":6,"n_rows":30,"n_cols":31,"rows_kept":30,"cut":false,"hidden":false,"merged":[[30,1,48,9],[3,1,26,9]]}
[null,"５　目標達成に向けた具体的な取組・対策"]
[null,"（１）二酸化炭素削減の取組・対策"]
[null,"（電気使用量、ガス使用量、自動車燃料等に関すること）"]
[null,null,null,null,null,null,null,null,null,null,null,null,null,null,null,null,null,null,null,null,null,null,null,null,null,null,null,null,null,null,"（対象年度におこなった内容、変化した管理事項も記載する）"]
[]
[]
[]
[]
[]
[]
[]
[]
[]
[]
[]
[]
[]
[]
[]
[]
[]
[]
[]
[]
[]
[]
[]
[]
[null,"（２）その他環境に重大な影響を与える項目の取組"]
[null,"（廃棄物等に関すること）"]
{"$rows_left_out":1}
{"sheet":"７ページ","index":7,"n_rows":44,"n_cols":20,"rows_kept":44,"cut":false,"hidden":false,"merged":[[44,19,45,30],[44,7,45,18],[2,2,2,4],[2,19,2,21],[2,5,2,18],[2,22,2,30],[5,2,5,30],[16,11,16,30],[17,2,24,30],[29,13,29,30],[30,2,37,30],[40,2,42,6],[43,2,45,6],[41,7,42,18],[41,19,42,30],[9,2,11,30]]}
[null,"６　取組の実施体制"]
[null,"（１）地球温暖化対策推進者の役職・氏名"]
[null,null,"役　職",null,null,null,null,null,null,null,null,null,null,null,null,null,null,null,null,"氏　名"]
[]
[null,"（２）担当組織名"]
[]
[]
[null,"（３）各取組の分担や責任者の配置状況 "]
[null,null,"（※組織図を添付）推進者の位置づけが分かるもの。　情報・説明がある場合に記載。"]
[]
[]
[]
[]
[null,"７　取組の運用状況"]
[null,"・目標達成状況と取組実施状況の確認・点検概況"]
[null,"（内部環境監査の記録の写しを添付すること）"]
[null,null,"・内部監査実施日：",null,null,null,null,null,null,null,null,"　　　　　年　　　月　　　日"]
[]
[]
[]
[]
[]
[]
[]
[]
[]
[null,"８　評価・見直し"]
[null,"・代表者等による全体の取組の評価・見直し概況"]
[null,"（マネジメントレビューの記録の写しを添付すること）"]
[null,null,"・代表者の見直し日：",null,null,null,null,null,null,null,null,null,null,"　　　　　年　　　月　　　日"]
{"$rows_left_out":15}
{"sheet":"欠格要件申告","index":8,"n_rows":25,"n_cols":11,"rows_kept":25,"cut":false,"hidden":false,"merged":[[11,0,17,10]]}
["別紙　　　　　　　"]
["埼玉県エコアップ認証事業所・欠格要件申告書"]
[]
[null,null,null,null,null,null,null,null,null,null,"令和　　年　　月　　日"]
[]
["（あて先）"]
["埼玉県知事　"]
[]
[]
[]
[]
["　私は、埼玉県エコアップ認証事業所の認証申請するに当たり、環境関係法令又は条例に係る規定のほか事業活動に関する法令若しくは条例、又は公租公課に関する法令若しくは条例に係る規定に違反し、行政処分又は刑罰を受けていないことを申告します。\n　また、埼玉県暴力団排除条例第２条で定める暴力団、同条で定める暴力団員が事業主又は役員となっている団体、又は同条例第３条第２項で定める暴力団関係者でないことを申告します。"]
[]
[]
[]
[]
[]
[]
[]
[]
[]
[]
[null,null,null,"申請者　","氏名又は名称"]
[null,null,null,null,"住所"]
[null,null,null,null,"法人の場合は代表者の氏名　　"]

{"sheet":"提出書類リスト","index":9,"n_rows":35,"n_cols":11,"rows_kept":35,"cut":false,"hidden":false,"merged":[[0,1,0,30],[2,10,3,30],[2,1,3,9],[9,10,10,30],[4,1,5,9],[28,10,28,30],[13,10,14,30],[15,10,16,30],[17,10,18,30],[26,10,26,30],[27,10,27,30]]}
[null,"提出書類"]
[]
[null,"項　　目",null,null,null,null,null,null,null,null,"提　出　書　類 (１ 部）"]
[]
[null,"１　エコアップ更新認証申請",null,null,null,null,null,null,null,null,"①本申請書一式 ※"]
[null,null,null,null,null,null,null,null,null,null,"・追加事項がある場合、逐次ページ追加する"]
[]
[null,"２　エコアップEMS関連",null,null,null,null,null,null,null,null,"①環境保全に関する取組チェックシート ※"]
[null,null,null,null,null,null,null,null,null,null,"②燃料使用量の単位換算（建物系）、算定報告様式（建物系）※"]
[null,null,null,null,null,null,null,null,null,null,"③燃料使用量の単位換算（工場・現場系）、算定報告様式（工場・\n   現場系）・・・対象があれば ※"]
[]
[null,null,null,null,null,null,null,null,null,null,"④自動車燃料に関するCO₂排出量　（自動車燃料チェックシート）※"]
[null,null,null,null,null,null,null,null,null,null,"⑤廃棄物等排出量実績（自己排出分） ※"]
[null,null,null,null,null,null,null,null,null,null,"   ⑥エコアップ認証にかかる目標達成のための具体的な取組（計画）\n      と実施状況の確認・評価の記録 ※"]
[]
[null,null,null,null,null,null,null,null,null,null,"     （目標と削減達成における年間の取組活動状況がわかる書類 ：\n　　 ＩＳＯなどのＥＭＰ、事業所独自の目標達成アクションプランや毎月\n     のエネルギー実績表やグラフなど）"]
[]
[null,null,null,null,null,null,null,null,null,null,"   ⑦会社全体の組織図（工場・支社・支店・営業所等が確認できる\n　    もの） ※"]
[]
[null,null,null,null,null,null,null,null,null,null,"⑧事業所一覧（複数の事業所がある場合）"]
[null,null,null,null,null,null,null,null,null,null,"⑨内部環境監査の記録　※"]
[null,null,null,null,null,null,null,null,null,null,"⑩マネジメントレビューの記録　※"]
[null,null,null,null,null,null,null,null,null,null,"⑪自動車の給油量・燃費管理表（任意）"]
[null,null,null,null,null,null,null,null,null,null,"⑫法令及びその他要求事項遵守評価表　※"]
[null,null,null,null,null,null,null,null,null,null,"⑬その他必要と認める書類"]
[]
[null,null,null,null,null,null,null,null,null,null,"<注1> ①、②、③、④、⑤は県の指定様式。⑥以降の様式は任意\n　の写し"]
[null,null,null,null,null,null,null,null,null,null,"<注2> ②、③、④は同一の「エコアップ認証用CO2排出量換算シート」\n　からの県の様式シート"]
[null,null,null,null,null,null,null,null,null,null,"「エコアップ認証CO2排出量換算シート」＃６、＃７、＃８シートも提出\n　する。"]
[]
{"$rows_left_out":6}
{"sheet":"補足説明","index":10,"n_rows":1,"n_cols":3,"rows_kept":1,"cut":false,"hidden":false,"merged":[[2,2,44,30],[1,2,1,30]]}
[null,null,"◆補足説明"]